在AS中首先导入了okhttputils这个包,使用正常,但是导入了volley.jar的时候出现问题了!。。
威尼斯人娱乐城
威尼斯人娱乐城
当前位置 : 威尼斯人娱乐城 > 澳门威尼斯人娱乐城

在AS中首先导入了okhttputils这个包,使用正常,但是导入了volley.jar的时候出现问题了!。。

出现的错误如下:

Information:Gradle tasks [:app:assembleDebug]
:app:preBuild UP-TO-DATE
:app:preDebugBuild UP-TO-DATE
:app:checkDebugManifest
:app:preReleaseBuild UP-TO-DATE
:app:prepareComAndroidSupportAppcompatV71910Library UP-TO-DATE
:app:prepareComZhyOkhttputils220Library UP-TO-DATE
:app:prepareDebugDependencies
:app:compileDebugAidl UP-TO-DATE
:app:compileDebugRenderscript UP-TO-DATE
:app:generateDebugBuildConfig UP-TO-DATE
:app:generateDebugAssets UP-TO-DATE
:app:mergeDebugAssets UP-TO-DATE
:app:generateDebugResValues UP-TO-DATE
:app:generateDebugResources UP-TO-DATE
:app:mergeDebugResources UP-TO-DATE
:app:processDebugManifest UP-TO-DATE
:app:processDebugResources UP-TO-DATE
:app:generateDebugSources UP-TO-DATE
:app:compileDebugJavaWithJavac UP-TO-DATE
:app:compileDebugNdk UP-TO-DATE
:app:compileDebugSources UP-TO-DATE
:app:transformClassesWithDexForDebug
UNEXPECTED TOP-LEVEL EXCEPTION:
Error:com.android.dx.cf.iface.ParseException: class name com/android/volley/CacheDispatcherTest does not match path tests/bin/classes/com/android/volley/CacheDispatcherTest.class

at com.android.dx.cf.direct.DirectClassFile.parse0DirectClassFile.java:520
at com.android.dx.cf.direct.DirectClassFile.parseDirectClassFile.java:406
at com.android.dx.cf.direct.DirectClassFile.parseToInterfacesIfNecessaryDirectClassFile.java:388
at com.android.dx.cf.direct.DirectClassFile.getMagicDirectClassFile.java:251
at com.android.dx.command.dexer.Main.parseClassMain.java:764
at com.android.dx.command.dexer.Main.access$1500Main.java:85
at com.android.dx.command.dexer.Main$ClassParserTask.callMain.java:1684
at com.android.dx.command.dexer.Main.processClassMain.java:749
... 12 more

1 error; aborting
Error:Execution failed for task :app:transformClassesWithDexForDebug.

com.android.ide.common.process.ProcessException: org.gradle.process.internal.ExecException: Process command C:\Program Files\Java\jdk1.8.0_05\bin\java.exe finished with non-zero exit value 1
Information:BUILD FAILED

Information:Total time: 23.87 secs
Information:2 errors
Information:0 warnings
Information:See complete output in console

求大神帮我看看怎么解决。。。

Build --> Clean Project
gradle sync

我把volley.jar从别的地方下载了,结果可以了。。。估计是原理的那个包有错。。

广告位

威尼斯人娱乐城